Cyclohexane, 1,2,4-trimethyl-, (1α,2α,4β)-

Kovats' RI, non-polar column, isothermal

View large format table.

Column type Active phase Temperature (C) I Reference Comment
CapillarySqualane50.883.3Lunskii and Paizanskaya, 1988He; Column length: 50. m; Column diameter: 0.22 mm
CapillarySqualane70.889.3Lunskii and Paizanskaya, 1988He; Column length: 50. m; Column diameter: 0.22 mm
CapillarySqualane100.893.1Lulova, Leont'eva, et al., 1976He; Column length: 120. m; Column diameter: 0.25 mm
CapillaryVacuum Grease Oil (VM-4)35.857.Sidorov, Petrova, et al., 1972
CapillaryVacuum Grease Oil (VM-4)35.880.Sidorov, Petrova, et al., 1972
CapillaryVacuum Grease Oil (VM-4)45.861.Sidorov, Petrova, et al., 1972
CapillaryVacuum Grease Oil (VM-4)45.884.Sidorov, Petrova, et al., 1972
CapillaryVacuum Grease Oil (VM-4)50.863.Sidorov, Petrova, et al., 1972
CapillaryVacuum Grease Oil (VM-4)50.886.Sidorov, Petrova, et al., 1972
CapillaryVacuum Grease Oil (VM-4)58.866.Sidorov, Petrova, et al., 1972
CapillaryVacuum Grease Oil (VM-4)58.890.Sidorov, Petrova, et al., 1972
CapillaryVacuum Grease Oil (VM-4)68.870.Sidorov, Petrova, et al., 1972
CapillaryVacuum Grease Oil (VM-4)68.894.Sidorov, Petrova, et al., 1972
PackedVacuum Grease Oil (VM-4)35.880.Sidorov, Ivanova, et al., 1971

Van Den Dool and Kratz RI, non-polar column, temperature ramp

View large format table.

Column type Active phase I Reference Comment
CapillaryPetrocol DH875.6Censullo, Jones, et al., 200350. m/0.25 mm/0.5 μm, He, 35. C @ 10. min, 3. K/min, 200. C @ 10. min
CapillaryOV-101879.4Yin, Liu, et al., 2001N2, 1. K/min; Column length: 80. m; Column diameter: 0.22 mm; Tstart: 30. C; Tend: 130. C

Normal alkane RI, non-polar column, custom temperature program

View large format table.

Column type Active phase I Reference Comment
CapillaryMethyl Silicone854.Spieksma, 1999Program: not specified

References

Lunskii and Paizanskaya, 1988
Lunskii, M.Kh.; Paizanskaya, I.L., Identification of hydrocarbons C1-C9 of petrol fractions of oils and condensates in the use of capillary columns with dinonylphthalate, Zh. Anal. Khim., 1988, 43, 127-135. [all data]

Lulova, Leont'eva, et al., 1976
Lulova, N.I.; Leont'eva, S.A.; Timofeeva, A.N., Gas-chromatographic method of determination of individual hydrocarbons in catalytic cracking gasolines in Proceedings of All-Union Research Institute on Oil Processes. Vol.18, All-Union Research Institute on Oil Processes, Moscow, 1976, 30-53. [all data]

Sidorov, Petrova, et al., 1972
Sidorov, R.I.; Petrova, V.I.; Ivanova, M.P., Qualitative analysis of wide-boiling fraction C5-C10 with capillary chromatography in Processes in chromatographic columns. Vol.17, 1972, 14-25. [all data]

Sidorov, Ivanova, et al., 1971
Sidorov, R.I.; Ivanova, M.P.; Petrova, V.I., Temperature dependence of cycloalkane's retention and its using in identification of structure, Gazovaya Khromatografiya, 1971, 15, 18-26. [all data]

Censullo, Jones, et al., 2003
Censullo, A.C.; Jones, D.R.; Wills, M.T., Speciation of the volatile organic compounds (VOCs) in solventborne aerosol coatings by solid phase microextraction-gas chromatography, J. Coat. Technol., 2003, 75, 936, 47-53, https://doi.org/10.1007/BF02697922 . [all data]

Yin, Liu, et al., 2001
Yin, C.; Liu, W.; Li, Z.; Pan, Z.; Lin, T.; Zhang, M., Chemometrics to chemical modeling: structural coding in hydrocarbons and retention indices of gas chromatography, J. Sep. Sci., 2001, 24, 3, 213-220, https://doi.org/10.1002/1615-9314(20010301)24:3<213::AID-JSSC213>3.0.CO;2-4 . [all data]

Spieksma, 1999
Spieksma, W., Determination of vapor liquid equilibrium from the Kovats retention index on dimethylsilicone using the Wilson mixing tool, J. Hi. Res. Chromatogr., 1999, 22, 10, 565-588, https://doi.org/10.1002/(SICI)1521-4168(19991001)22:10<565::AID-JHRC565>3.0.CO;2-2 . [all data]