2-Chlorobenzoic acid, allyl ester

Van Den Dool and Kratz RI, non-polar column, temperature ramp

Data compiled by: NIST Mass Spectrometry Data Center, William E. Wallace, director

Column type CapillaryCapillaryCapillary
Active phase SE-30SE-30SE-30
Column length (m)
Carrier gas
Substrate
Column diameter (mm)
Phase thickness (μm)
Tstart (C) 100.100.100.
Tend (C) 280.280.280.
Heat rate (K/min) 10.2.6.
Initial hold (min)
Final hold (min)
I 1407.1396.1403.
ReferenceKorhonen and Lind, 1985Korhonen and Lind, 1985Korhonen and Lind, 1985
Comment MSDC-RI MSDC-RI MSDC-RI

References

Korhonen and Lind, 1985
Korhonen, I.O.O.; Lind, M.A., Gas-liquid chromatographic analyses. XXXVIII. Capillary column studies of unsaturated esters of benzoic and monochlorobenzoic acids, J. Chromatogr., 1985, 324, 113-127, https://doi.org/10.1016/S0021-9673(01)81311-X . [all data]