Pyridine,2-(1-(2-iodophenyl))ethenyl-

Gas phase ion energetics data

Data compiled as indicated in comments:
LLK - Sharon G. Lias, Rhoda D. Levin, and Sherif A. Kafafi

Ionization energy determinations

IE (eV) Method Reference Comment
8.3EIGrutzmacher, Schaldach, et al., 1980LLK

Appearance energy determinations

Ion AE (eV) Other Products MethodReferenceComment
C13H10N+8.8IEIGrutzmacher, Schaldach, et al., 1980LLK

References

Grutzmacher, Schaldach, et al., 1980
Grutzmacher, H.-F.; Schaldach, B.; Schubert, R.; Ramana, D.V., Ion kinetic energy release as a transition state probe in intramolecular aromatic substitutions, Adv. Mass Spectrom., 1980, 8, 795. [all data]