Cyclobutanone, cyclobutylidenehydrazone

Gas phase ion energetics data

Data compiled by: Sharon G. Lias, John E. Bartmess, Joel F. Liebman, John L. Holmes, Rhoda D. Levin, and W. Gary Mallard

Ionization energy determinations

IE (eV) Method Reference Comment
8.83PEKirste, Poppek, et al., 1984Vertical value

References

Kirste, Poppek, et al., 1984
Kirste, K.; Poppek, R.; Rademacher, P., Photoelektronenspektren und konformationsverhalten von azinen, Chem. Ber., 1984, 117, 1061. [all data]