2,2,4-Trimethyl-1,3-dioxane

Gas phase ion energetics data

Data compiled as indicated in comments:
LBLHLM - Sharon G. Lias, John E. Bartmess, Joel F. Liebman, John L. Holmes, Rhoda D. Levin, and W. Gary Mallard

Ionization energy determinations

IE (eV) Method Reference Comment
9.63PEAsfandiarov and Zykov, 1983Vertical value; LBLHLM

References

Asfandiarov and Zykov, 1983
Asfandiarov, N.L.; Zykov, B.G., Photoelectron spectra of methyl-substituted 1,3-Dioxanes, Bull. Acad. Sci. USSR, Div. Chem. Sci., 1983, 10, 2069, In original 2293. [all data]