1-Methyl-1,2,3,6-tetrahydropyridine

Gas phase ion energetics data

Data compiled as indicated in comments:
LLK - Sharon G. Lias, Rhoda D. Levin, and Sherif A. Kafafi

Ionization energy determinations

IE (eV) Method Reference Comment
8.67 ± 0.05PEMorishima, Yoshikawa, et al., 1975Vertical value; LLK

References

Morishima, Yoshikawa, et al., 1975
Morishima, I.; Yoshikawa, K.; Hashimoto, M.; Bekki, K., Homoallylic interaction between the nitrogen lone pair and the nonadjacent π bond in cyclic and bicyclic amines. I. Photoelectron spectroscopic study, J. Am. Chem. Soc., 1975, 97, 4283. [all data]