4,8,12-Tetradecatrienal, 5,9,13-trimethyl-

Normal alkane RI, non-polar column, temperature ramp

Data compiled by: NIST Mass Spectrometry Data Center, William E. Wallace, director

Column type Capillary
Active phase CP Sil 5 CB
Column length (m) 30.
Carrier gas He
Substrate
Column diameter (mm) 0.25
Phase thickness (μm) 0.25
Tstart (C) 40.
Tend (C) 220.
Heat rate (K/min) 4.
Initial hold (min) 1.
Final hold (min)
I 1933.
ReferenceRohloff and Bones, 2005
Comment MSDC-RI

References

Rohloff and Bones, 2005
Rohloff, J.; Bones, A.M., Volatile profiling of Arabidopsis thaliana - Putative olfactory compounds in plant communication, Phytochemistry, 2005, 66, 16, 1941-1955, https://doi.org/10.1016/j.phytochem.2005.06.021 . [all data]