7-Nitro-3,4-benzocoumarin

Lee's RI, non-polar column, temperature ramp

View large format table.

Column type Active phase I Reference Comment
CapillarySE-52394.97White, Robbat, et al., 198330. m/0.3 mm/0.25 μm, He, 4. K/min; Tstart: 25. C; Tend: 295. C
CapillarySE-52394.41White, Robbat, et al., 198330. m/0.2 mm/0.25 μm, He, 4. K/min; Tstart: 25. C; Tend: 295. C

Lee's RI, non-polar column, custom temperature program

View large format table.

Column type Active phase I Reference Comment
CapillaryDB-5391.48Helmig and Arey, 199260. m/0.25 mm/0.25 μm; Program: 50C(1min) => 25C/min => 150C => 4C/min => 325C

References

White, Robbat, et al., 1983
White, C.M.; Robbat, A., Jr.; Hoes, R.M., Gas chromatographic retention characteristics of nitrated polycyclic aromatic hydrocarbons on SE-52, Chromatographia, 1983, 17, 11, 605-612, https://doi.org/10.1007/BF02261944 . [all data]

Helmig and Arey, 1992
Helmig, D.; Arey, J., Analytical chemistry of four nitrodibenzopyranone isomers for ambient air analysis, Int. J. Environ. Anal. Chem., 1992, 49, 4, 207-219, https://doi.org/10.1080/03067319208027572 . [all data]