5H-Thiazolo[3,2-a]pyridin-5-one,2,3-dihydro-

Gas phase ion energetics data

Data compiled by: Sharon G. Lias, Rhoda D. Levin, and Sherif A. Kafafi

Ionization energy determinations

IE (eV) Method Reference
7.91 ± 0.05EILaerum and Undheim, 1978

References

Laerum and Undheim, 1978
Laerum, T.; Undheim, K., N-Quaternary compounds. Part 52. Photochemically induced valence bond isomerism and rearrangement to pyridinones of thiazolo[3,2-a]-pyridinium-8-olate derivatives, J. Chem. Soc. Perkin Trans. 1, 1978, 1150. [all data]