Methoxyacetylene
- Formula: C3H4O
- Molecular weight: 56.0633
- IUPAC Standard InChIKey: QRNDDJXJUHBGSG-UHFFFAOYSA-N
- CAS Registry Number: 6443-91-0
- Chemical structure:
View 3d structure (requires JavaScript / HTML 5) - Permanent link for this species. Use this link for bookmarking this species for future reference.

Gas phase ion energetics data

Data compiled as indicated in comments:
LBLHLM - Sharon G. Lias, John E. Bartmess, Joel F. Liebman, John L. Holmes, Rhoda D. Levin, and W. Gary Mallard
Ionization energy determinations
IE (eV) | Method | Reference | Comment |
---|---|---|---|
9.48 | EI | Holmes and Lossing, 1986 | LBLHLM |
Appearance energy determinations
Ion | AE (eV) | Other Products | Method | Reference | Comment |
---|---|---|---|---|---|
C2HO+ | 12.4 | CH3 | EI | Holmes and Lossing, 1986 | LBLHLM |

References

Holmes and Lossing, 1986
Holmes, J.L.; Lossing, F.P.,
Title unavailable,
Personal communication to S.G. Lias, 1986. [all data]