Thiophene,2,5-dimethyl-3-(methylthio)-

Gas phase ion energetics data

Data compiled by: Sharon G. Lias, Rhoda D. Levin, and Sherif A. Kafafi

Ionization energy determinations

IE (eV) Method Reference
7.96 ± 0.05EICederlund, Lantz, et al., 1977

References

Cederlund, Lantz, et al., 1977
Cederlund, B.; Lantz, R.; Hornfeldt, A.-B.; Thorstad, O.; Undheim, K., Preparation of some thiophene-, selenophene- and furanthiols. Ionisation potentials in tautomer analysis, Acta Chem. Scand. Ser. B:, 1977, 31, 198. [all data]