Decane, 2,4,6-trimethyl-

Normal alkane RI, non-polar column, temperature ramp

Data compiled by: NIST Mass Spectrometry Data Center, William E. Wallace, director

Column type Capillary
Active phase HP-5 MS
Column length (m) 30.
Carrier gas Helium
Substrate
Column diameter (mm) 0.25
Phase thickness (μm) 0.25
Tstart (C) 50.
Tend (C) 240.
Heat rate (K/min) 5.
Initial hold (min)
Final hold (min)
I 1121.
ReferenceSadashava, Sharanappa, et al., 2010
Comment MSDC-RI

References

Sadashava, Sharanappa, et al., 2010
Sadashava, C.T.; Sharanappa, P.; Remashree, A.B.; Raghu, A.V.; Udayan, P.S.; Balachandran, I., Chemical composition and antimicrobial activity of the essential oil from bark of Pittosporum dasycaulon Mig., Adv. Biol. Res., 2010, 4, 6, 301-304. [all data]