Benzene, 1,3,5-tribromo-2-methoxy-

Normal alkane RI, non-polar column, custom temperature program

Data compiled by: NIST Mass Spectrometry Data Center, William E. Wallace, director

Column type Capillary
Active phase CP Sil 2
Column length (m) 55.
Carrier gas N2
Substrate
Column diameter (mm) 0.25
Phase thickness (μm) 0.25
Program 40C(3min) => 20C/min => 80C => 2C/min => 240C(45min)
I 1633.
ReferenceFuhrer, Deissler, et al., 1997
Comment MSDC-RI

References

Fuhrer, Deissler, et al., 1997
Fuhrer, U.; Deissler, A.; Schreitmuller, J.; Ballschmiter, K., Analysis of Halogenated Methoxybenzenes and Hexachlorobenzene (HCB) in the Picogram m-3 Range in Marine Air, Chromatographia, 1997, 45, 1, 414-427, https://doi.org/10.1007/BF02505594 . [all data]