Bicyclo[2.2.1]hept-5-ene-2,3-dione,7,7-dimethyl-

Gas phase ion energetics data

Data compiled as indicated in comments:
LLK - Sharon G. Lias, Rhoda D. Levin, and Sherif A. Kafafi

Ionization energy determinations

IE (eV) Method Reference Comment
8.2PEDougherty, Blankespoor, et al., 1979LLK
8.50 ± 0.05PEDougherty, Blankespoor, et al., 1979Vertical value; LLK

References

Dougherty, Blankespoor, et al., 1979
Dougherty, D.; Blankespoor, R.L.; McGlynn, S.P., Photoelectron spectroscopy of carbonyls. Bicyclo[2.2.1]heptane-2,3-diones and bicyclo[2.2.1]hept-5-ene-2,3-diones., J. Electron Spectrosc. Relat. Phenom., 1979, 16, 245. [all data]