2-Butenoic acid, 2-methylpropyl ester

Kovats' RI, non-polar column, isothermal

View large format table.

Column type Active phase Temperature (C) I Reference Comment
PackedSE-30150.975.Ashes and Haken, 1975He, Celatom silanized (62-72 mesh); Column length: 3.7 m
PackedOV-1150.983.Ashes and Haken, 1971
PackedSE-30150.983.Germaine and Haken, 1969Celite 560; Column length: 3.7 m

Normal alkane RI, non-polar column, temperature ramp

View large format table.

Column type Active phase I Reference Comment
CapillaryOV-11010.Schreyen, Dirinck, et al., 1979N2, 1. K/min; Column length: 183. m; Column diameter: 0.762 mm; Tstart: 0. C; Tend: 230. C

References

Ashes and Haken, 1975
Ashes, J.R.; Haken, J.K., Gas chromatography of homologous esters. IX. Structure-retention increments of unsaturated esters, J. Chromatogr., 1975, 111, 1, 171-187, https://doi.org/10.1016/S0021-9673(01)80159-X . [all data]

Ashes and Haken, 1971
Ashes, J.R.; Haken, J.K., Gas chromatography of homologous esters. Part V. Retention of aliphatic esters on non-polar, donar and acceptor stationary phases, J. Chromatogr., 1971, 60, 33-44, https://doi.org/10.1016/S0021-9673(00)95527-4 . [all data]

Germaine and Haken, 1969
Germaine, R.W.; Haken, J.K., Gas chromatography of homologous esters. Part 2. Unsaturated esters, J. Chromatogr., 1969, 43, 43-47, https://doi.org/10.1016/S0021-9673(00)99163-5 . [all data]

Schreyen, Dirinck, et al., 1979
Schreyen, L.; Dirinck, P.; Sandra, P.; Schamp, N., Flavor analysis of quince, J. Agric. Food Chem., 1979, 27, 4, 872-876, https://doi.org/10.1021/jf60224a058 . [all data]