Bicyclo[2.2.1]hept-2-ene,5-bromo-,exo-

Gas phase ion energetics data

Data compiled by: Sharon G. Lias, Rhoda D. Levin, and Sherif A. Kafafi

Ionization energy determinations

IE (eV) Method Reference
9.2EITomer, Turk, et al., 1972

Appearance energy determinations

Ion AE (eV) Other Products MethodReferenceComment
C5H6+10.0C2H3BrEITomer, Turk, et al., 1972
C7H9+10.2BrEITomer, Turk, et al., 1972

References

Tomer, Turk, et al., 1972
Tomer, K.B.; Turk, J.; Shapiro, R.H., Anchimeric assistance in electron-impact reactions: Homoallylic systems, Org. Mass Spectrom., 1972, 6, 235. [all data]