2-Propanone, 1-methoxy-
- Formula: C4H8O2
- Molecular weight: 88.1051
- IUPAC Standard InChIKey: CUZLJOLBIRPEFB-UHFFFAOYSA-N
- CAS Registry Number: 5878-19-3
- Chemical structure:
View 3d structure (requires JavaScript / HTML 5) - Other names: Methoxyacetone; CH3COCH2OCH3; Methoxy-2-propanone; 1-Methoxyacetone; Methoxymethyl methyl ketone; 1-Methoxy-2-propanone; 1-Methoxypropan-2-one

Van Den Dool and Kratz RI, polar column, temperature ramp

Column type | Active phase | I | Reference | Comment |
---|---|---|---|---|
Capillary | Supelcowax-10 | 1104. | Chung, Yung, et al., 2001 | 60. m/0.25 mm/0.25 μm, He, 35. C @ 5. min, 2. K/min, 195. C @ 90. min |
Capillary | Supelcowax-10 | 1104. | Chung, 1999 | 60. m/0.25 mm/0.25 μm, He, 35. C @ 5. min, 2. K/min, 195. C @ 90. min |

Normal alkane RI, polar column, temperature ramp

Column type | Active phase | I | Reference | Comment |
---|---|---|---|---|
Capillary | DB-Wax | 1137. | Lee and Shibamoto, 2000 | 30. m/0.25 mm/0.25 μm, He, 3. K/min, 180. C @ 40. min; Tstart: 50. C |
Capillary | DB-Wax | 1100. | Umano, Nakahara, et al., 1999 | 60. m/0.25 mm/0.25 μm, He, 40. C @ 2. min, 2. K/min; Tend: 200. C |

Gas phase ion energetics data

Data compiled as indicated in comments:
MM - Michael M. Meot-Ner (Mautner)
LBLHLM - Sharon G. Lias, John E. Bartmess, Joel F. Liebman, John L. Holmes, Rhoda D. Levin, and W. Gary Mallard
Proton affinity at 298K
Proton affinity (kJ/mol) | Reference | Comment |
---|---|---|
847. ± 2. | Morlender-Vais and Holmes, 2001 | Plots of lnR (dissociation product ratio RH+/MH+) vs. PA(B) in metastable ion and CID experiments.; MM |
Ionization energy determinations
IE (eV) | Method | Reference | Comment |
---|---|---|---|
9.66 | PE | Olivato, Guerrero, et al., 1984 | Vertical value; LBLHLM |

Phase change data

Data compiled by: Robert L. Brown and Stephen E. Stein
Quantity | Value | Units | Method | Reference | Comment |
---|---|---|---|---|---|
Tboil | 391.2 | K | N/A | Weast and Grasselli, 1989 |

References

Chung, Yung, et al., 2001
Chung, H.Y.; Yung, I.K.S.; Kim, J.-S.,
Comparison of volatile components in dried scallops (Chlamys farreri and Patinopecten yessoensis) prepared by boiling and steaming methods,
J. Agric. Food Chem., 2001, 49, 1, 192-202, https://doi.org/10.1021/jf000692a
. [all data]
Chung, 1999
Chung, H.Y.,
Volatile components in crabmeats of Charybdis feriatus,
J. Agric. Food Chem., 1999, 47, 6, 2280-2287, https://doi.org/10.1021/jf981027t
. [all data]
Lee and Shibamoto, 2000
Lee, K.-G.; Shibamoto, T.,
Antioxidant properties of aroma compounds isolated from soybeans and mung beans,
J. Agric. Food Chem., 2000, 48, 9, 4290-4293, https://doi.org/10.1021/jf000442u
. [all data]
Umano, Nakahara, et al., 1999
Umano, K.; Nakahara, K.; Shoji, A.; Shibamoto, T.,
Aroma chemicals isolated and identified from leaves of aloe arborescens Mill. Var. natalensis Berger,
J. Agric. Food Chem., 1999, 47, 9, 3702-3705, https://doi.org/10.1021/jf990116i
. [all data]