4(1H)-Pyrimidinone, 2-(methylthio)-

Gas phase ion energetics data

Data compiled by: Sharon G. Lias and Joel F. Liebman

Ionization energy determinations

IE (eV) Method Reference
8.70PEKatritzky and Szafrani, 1990

References

Katritzky and Szafrani, 1990
Katritzky, A.R.; Szafrani, M., The tautomeric equilibria of thio analogues of nucleic acid bases. Part 3. Ultraviolet photoelectron spectra of 2-thiouracil and its methyl derivatives, J. Chem. Soc. Perkin Trans. 2, 1990, 871. [all data]