Phenanthrene, tetradecahydro-
- Formula: C14H24
- Molecular weight: 192.3404
- IUPAC Standard InChIKey: GNMCGMFNBARSIY-UHFFFAOYSA-N
- CAS Registry Number: 5743-97-5
- Chemical structure:
View 3d structure (requires JavaScript / HTML 5) - Species with the same structure:
- Stereoisomers:
- Other names: Perhydrophenanthrene; Tetradecahydrophenanthrene; Perhydrophenanthrene, % 5; Perhydrophenanthrene, # 2; Perhydrophenanthrene, # 6; Perhydrophenanthrene, # 1; Perhydrophenanthrene, # 3; Perhydrophenanthrene, # 4; Perhydrophenanthrene, # 7; Perhydrophenanthrene, # 9; Perhydrophenanthrene, # 8

Kovats' RI, non-polar column, isothermal

Column type | Active phase | Temperature (C) | I | Reference | Comment |
---|---|---|---|---|---|
Capillary | OV-1 | 150. | 1514. | Zhang, Chen, et al., 1997 | 25. m/0.2 mm/0.33 μm, N2 |
Capillary | SE-30 | 175. | 1519. | Bredael, 1982 | Column length: 100. m; Column diameter: 0.5 mm |
Capillary | SE-30 | 150. | 1514. | Bredael, 1982 | Column length: 100. m; Column diameter: 0.5 mm |
Capillary | SE-30 | 175. | 1539. | Bredael, 1982 | Column length: 100. m; Column diameter: 0.5 mm |
Capillary | SE-30 | 130. | 1517. | Bredael, 1982 | Column length: 100. m; Column diameter: 0.5 mm |
Capillary | SE-30 | 150. | 1539. | Bredael, 1982 | Column length: 100. m; Column diameter: 0.5 mm |
Capillary | SE-30 | 175. | 1566. | Bredael, 1982 | Column length: 100. m; Column diameter: 0.5 mm |
Capillary | SE-30 | 130. | 1534. | Bredael, 1982 | Column length: 100. m; Column diameter: 0.5 mm |
Capillary | SE-30 | 150. | 1554. | Bredael, 1982 | Column length: 100. m; Column diameter: 0.5 mm |
Capillary | SE-30 | 175. | 1578. | Bredael, 1982 | Column length: 100. m; Column diameter: 0.5 mm |
Capillary | SE-30 | 130. | 1560. | Bredael, 1982 | Column length: 100. m; Column diameter: 0.5 mm |
Capillary | SE-30 | 150. | 1581. | Bredael, 1982 | Column length: 100. m; Column diameter: 0.5 mm |
Capillary | SE-30 | 150. | 1510. | Bredael, 1982 | Column length: 100. m; Column diameter: 0.5 mm |
Capillary | SE-30 | 175. | 1528. | Bredael, 1982 | Column length: 100. m; Column diameter: 0.5 mm |
Capillary | SE-30 | 130. | 1509. | Bredael, 1982 | Column length: 100. m; Column diameter: 0.5 mm |
Capillary | SE-30 | 150. | 1528. | Bredael, 1982 | Column length: 100. m; Column diameter: 0.5 mm |
Capillary | SE-30 | 175. | 1556. | Bredael, 1982 | Column length: 100. m; Column diameter: 0.5 mm |
Capillary | SE-30 | 130. | 1559. | Bredael, 1982 | Column length: 100. m; Column diameter: 0.5 mm |
Capillary | SE-30 | 150. | 1581. | Bredael, 1982 | Column length: 100. m; Column diameter: 0.5 mm |
Capillary | SE-30 | 130. | 1543. | Bredael, 1982 | Column length: 100. m; Column diameter: 0.5 mm |
Capillary | SE-30 | 150. | 1567. | Bredael, 1982 | Column length: 100. m; Column diameter: 0.5 mm |

Condensed phase thermochemistry data

Data compiled by: Eugene S. Domalski and Elizabeth D. Hearing
Constant pressure heat capacity of liquid
Cp,liquid (J/mol*K) | Temperature (K) | Reference | Comment |
---|---|---|---|
330.1 | 313. | Gudinowicz, Campbell, et al., 1963 | T = 313 to 583 K. |
Constant pressure heat capacity of solid
Cp,solid (J/mol*K) | Temperature (K) | Reference | Comment |
---|---|---|---|
289.5 | 298. | Nuzzi, 1982 | T = 193 to 403 K. |
345.6 | 298. | Nuzzi, 1982 | T = 193 to 403 K. |
281.2 | 298. | Nuzzi, 1982 | T = 193 to 403 K. |

Phase change data

Data compiled as indicated in comments:
AC - William E. Acree, Jr., James S. Chickos
DH - Eugene S. Domalski and Elizabeth D. Hearing
Enthalpy of vaporization
ΔvapH (kJ/mol) | Temperature (K) | Method | Reference | Comment |
---|---|---|---|---|
55.7 | 470. | EB | Rohác, Censký, et al., 2000 | Based on data from 455. to 551. K.; AC |
Enthalpy of fusion
ΔfusH (kJ/mol) | Temperature (K) | Reference | Comment |
---|---|---|---|
11.155 | 313. | Nuzzi, 1982 | DH |
10.481 | 273. | Nuzzi, 1982 | DH |
11.832 | 283. | Nuzzi, 1982 | DH |
Entropy of fusion
ΔfusS (J/mol*K) | Temperature (K) | Reference | Comment |
---|---|---|---|
35.64 | 313. | Nuzzi, 1982 | DH |
38.39 | 273. | Nuzzi, 1982 | DH |
41.81 | 283. | Nuzzi, 1982 | DH |

Reaction thermochemistry data

Data compiled by: Hussein Y. Afeefy, Joel F. Liebman, and Stephen E. Stein
Individual Reactions
By formula: 7H2 + C14H10 = C14H24
Quantity | Value | Units | Method | Reference | Comment |
---|---|---|---|---|---|
ΔrH° | -565. | kJ/mol | Eqk | Frye, 1962 | gas phase |

References

Zhang, Chen, et al., 1997
Zhang, M.; Chen, B.; Shen, S.; Chen, S.,
Compositional studies of high-temperature coal tar by g.c.-FT-i.r. analysis of middle oil fractions,
Fuel, 1997, 76, 5, 415-423, https://doi.org/10.1016/S0016-2361(97)85518-4
. [all data]
Bredael, 1982
Bredael, P.,
Retention indices of hydrocarbons on SE-30,
J. Hi. Res. Chromatogr. Chromatogr. Comm., 1982, 5, 6, 325-328, https://doi.org/10.1002/jhrc.1240050610
. [all data]