Tricyclo[4.2.2.02,5]dec-7-ene,9,10-bis(methylene)-(1α,2α,5α,6α)-

Gas phase ion energetics data

Data compiled by: Sharon G. Lias, Rhoda D. Levin, and Sherif A. Kafafi

Ionization energy determinations

IE (eV) Method Reference Comment
8.40 ± 0.03PEPfeffer, Klessinger, et al., 1975Vertical value

References

Pfeffer, Klessinger, et al., 1975
Pfeffer, H.-U.; Klessinger, M.; Erker, G.; Roth, W.R., Photoelektronenspektren organischer Verbindungen, VIII 7,8-Dimethylenbicyclo[2.2.2]octa-2,5-dien und verwandte Verbindungen, Chem. Ber., 1975, 108, 2923. [all data]