Quinazoline,4-fluoro-

Gas phase ion energetics data

Data compiled by: Sharon G. Lias, Rhoda D. Levin, and Sherif A. Kafafi

Ionization energy determinations

IE (eV) Method Reference Comment
9.22PEVan Den Ham, Beerlage, et al., 1975Vertical value

References

Van Den Ham, Beerlage, et al., 1975
Van Den Ham, D.M.W.; Beerlage, M.; Van Der Meer, D.; Feil, D., Photoelectron spectra of fluorine substituted diazanaphthalenes: "even cases", J. Electron Spectrosc. Relat. Phenom., 1975, 7, 33. [all data]