Kaur-16-ene

Normal alkane RI, polar column, temperature ramp

Data compiled by: NIST Mass Spectrometry Data Center, William E. Wallace, director

Column type Capillary
Active phase Innowax FSC
Column length (m) 60.
Carrier gas Helium
Substrate
Column diameter (mm) 0.25
Phase thickness (μm)
Tstart (C) 60.
Tend (C) 220.
Heat rate (K/min) 4.
Initial hold (min) 10.
Final hold (min)
I 2438.
ReferenceLourens, Reddy, et al., 2004
Comment MSDC-RI

References

Lourens, Reddy, et al., 2004
Lourens, A.C.U.; Reddy, D.; Baser, K.H.C.; Viljoen, A.M.; Van Vuuren, S.F., In vitro Biological Activity and Essential Oil Composition of Four Indigenous South Africal Helichrysum Species, J. Ethnopharmacol., 2004, 95, 2-3, 253-258, https://doi.org/10.1016/j.jep.2004.07.027 . [all data]