5-Hydroxymethyl-2-furoic acid, 2TMS derivative

Van Den Dool and Kratz RI, non-polar column, temperature ramp

View large format table.

Column type Active phase I Reference Comment
CapillaryOV-11540.Lefevere, Verhaeghe, et al., 198910. m/0.22 mm/0.17 μm, He, 5. K/min; Tstart: 70. C; Tend: 270. C
CapillarySE-521560.Lefevere, Verhaeghe, et al., 198925. m/0.32 mm/0.52 μm, He, 5. K/min; Tstart: 70. C; Tend: 270. C
CapillaryUltra-21561.Tuchman, Bowers, et al., 198425. m/0.31 mm/0.52 μm, He, 5. K/min; Tstart: 50. C; Tend: 300. C

References

Lefevere, Verhaeghe, et al., 1989
Lefevere, M.F.; Verhaeghe, B.J.; Declerck, D.H.; Van Bocxlaer, J.F.; De Leenheer, A.P.; De Sagher, R.M., Metabolic Profiling of Urinary Organic Acids by Single and Multicolumn Capillary Gas Chromatography, J. Chromatogr. Sci., 1989, 27, 1, 23-29, https://doi.org/10.1093/chromsci/27.1.23 . [all data]

Tuchman, Bowers, et al., 1984
Tuchman, M.; Bowers, L.D.; Fregien, K.D.; Crippin, P.J.; Krivit, W., Capillary Gas Chromatographic Separation of Urinary Organic Acids. Retention Indices of 101 Urinary Acids on a 5% Phenylmethyl Silicone Capillary Column, J. Chromatogr. Sci., 1984, 22, 5, 198-202, https://doi.org/10.1093/chromsci/22.5.198 . [all data]