(E)-9,11-Dodecadien-1-ol

Normal alkane RI, non-polar column, temperature ramp

View large format table.

Column type Active phase I Reference Comment
CapillaryDB-51501.Sasaerila, Gries, et al., 199730. m/0.25 mm/0.32 μm, 10. K/min; Tstart: 50. C; Tend: 200. C

References

Sasaerila, Gries, et al., 1997
Sasaerila, Y.; Gries, G.; Khaskin, G.; Gries, R.; Hardi, Identification of sex pheromone components of nettle caterpillar, Setothosea asigna, J. Chem. Ecol., 1997, 23, 9, 2187-2196, https://doi.org/10.1023/B:JOEC.0000006438.03728.1a . [all data]