6,7-Diazabicyclo[3.2.2]non-6-ene 6,7-dioxide

Gas phase ion energetics data

Data compiled by: Sharon G. Lias, Rhoda D. Levin, and Sherif A. Kafafi

Ionization energy determinations

IE (eV) Method Reference
8.04 ± 0.03PEBunzli, Olsen, et al., 1977

References

Bunzli, Olsen, et al., 1977
Bunzli, J.-C.G.; Olsen, H.; Snyder, J.P., Photoelectron spectra of bicyclic azo N-oxides and azo N, N'-dioxides, J. Org. Chem., 1977, 42, 614. [all data]