trans-2,3-Epoxydecane

Kovats' RI, non-polar column, isothermal

View large format table.

Column type Active phase Temperature (C) I Reference Comment
PackedSE-30120.1147.Bierl, Beroza, et al., 1972Column length: 3.0 m

References

Bierl, Beroza, et al., 1972
Bierl, B.A.; Beroza, M.; Aldridge, M.H., Effect of functional-group position on retention indices of six classes of compounds on four stationary phases, J. Chromatogr. Sci., 1972, 10, 12, 712-715, https://doi.org/10.1093/chromsci/10.12.712 . [all data]