9H-Fluorene, 3-nitro-

Lee's RI, non-polar column, temperature ramp

View large format table.

Column type Active phase I Reference Comment
CapillaryDB-5347.86Helmig and Arey, 199160. m/0.24 mm/0.25 μm, 6. K/min; Tstart: 50. C; Tend: 280. C
CapillarySE-52328.71White, Robbat, et al., 198330. m/0.3 mm/0.25 μm, He, 4. K/min; Tstart: 25. C; Tend: 295. C

References

Helmig and Arey, 1991
Helmig, D.; Arey, J., Analytical chemistry of airborne nitrofluorenes, Int. J. Environ. Anal. Chem., 1991, 43, 4, 219-233, https://doi.org/10.1080/03067319108027526 . [all data]

White, Robbat, et al., 1983
White, C.M.; Robbat, A., Jr.; Hoes, R.M., Gas chromatographic retention characteristics of nitrated polycyclic aromatic hydrocarbons on SE-52, Chromatographia, 1983, 17, 11, 605-612, https://doi.org/10.1007/BF02261944 . [all data]