Bornane, 2,2,5-endo,6-exo,8,9,10-heptachloro-

Kovats' RI, non-polar column, custom temperature program

Data compiled by: NIST Mass Spectrometry Data Center, William E. Wallace, director

Column type Capillary
Active phase DB-5MS
Column length (m) 60.
Carrier gas He
Substrate
Column diameter (mm) 0.25
Phase thickness (μm) 0.25
Program 100C(1min) => 20C/min => 210C => 0.8C/min => 270C => 25C/min => 325C(10min)
I 2297.2
ReferenceMcDonald J.G., Vetter W., et al., 2001
Comment MSDC-RI

References

McDonald J.G., Vetter W., et al., 2001
McDonald J.G.; Vetter W.; Hites R.A., Methylene retention indexes far isolated toxaphene congeners, Anal. Chem., 2001, 73, 6, 1374-1376, https://doi.org/10.1021/ac001119t . [all data]