1-Azabicyclo[2.2.2]octane, 4-phenyl-
- Formula: C13H17N
- Molecular weight: 187.2808
- IUPAC Standard InChIKey: CSKNWIPXDBBWRW-UHFFFAOYSA-N
- CAS Registry Number: 51069-11-5
- Chemical structure:
View 3d structure (requires JavaScript / HTML 5) - Permanent link for this species. Use this link for bookmarking this species for future reference.

Gas phase ion energetics data

Data compiled by: Sharon G. Lias, Rhoda D. Levin, and Sherif A. Kafafi
Ionization energy determinations
IE (eV) | Method | Reference | Comment |
---|---|---|---|
8.13 ± 0.015 | PE | Bieri and Heilbronner, 1974 | Vertical value |

References

Bieri and Heilbronner, 1974
Bieri, G.; Heilbronner, E.,
Der einfluss von substituenten in stellung 4 auf das n-ionisations- zpotenial des chinuclidins,
Helv. Chim. Acta, 1974, 57, 546. [all data]