Diethyl 4-chlorophenyl phosphate
- Formula: C10H14ClO4P
- Molecular weight: 264.643
- IUPAC Standard InChIKey: LBGVKIMCKGXEEF-UHFFFAOYSA-N
- CAS Registry Number: 5076-63-1
- Chemical structure:
View 3d structure (requires JavaScript / HTML 5) - Permanent link for this species. Use this link for bookmarking this species for future reference.

Kovats' RI, non-polar column, isothermal

Column type | Active phase | Temperature (C) | I | Reference | Comment |
---|---|---|---|---|---|
Capillary | OV-101 | 200. | 1675. | Gandhe, Purnanand, et al., 1990 | N2; Column length: 30. m; Column diameter: 0.32 mm |

Kovats' RI, polar column, isothermal

Column type | Active phase | Temperature (C) | I | Reference | Comment |
---|---|---|---|---|---|
Capillary | DB-Wax | 200. | 2410. | Gandhe, Purnanand, et al., 1990 | N2; Column length: 30. m; Column diameter: 0.32 mm |

References

Gandhe, Purnanand, et al., 1990
Gandhe, B.R.; Purnanand; Prasad, R.; Danikhel, R.K.; Shinde, S.K.; Srivastava, R.K.; Batra, B.S.; Rao, K.M.,
Use of gas chromatographic retention indices for quantitative structure activity relationship studies of dialkyl phenyl phosphates,
Pestic. Sci., 1990, 29, 4, 379-385, https://doi.org/10.1002/ps.2780290402
. [all data]