2,6-Octadiene
- Formula: C8H14
- Molecular weight: 110.1968
- IUPAC Standard InChIKey: LAGGTOBQMQHXON-UHFFFAOYSA-N
- CAS Registry Number: 4974-27-0
- Chemical structure:
View 3d structure (requires JavaScript / HTML 5) - Stereoisomers:
- Other names: 1,6-Dimethyldiallyl; Octa-2,6-diene

Gas phase ion energetics data

Data compiled by: Sharon G. Lias, John E. Bartmess, Joel F. Liebman, John L. Holmes, Rhoda D. Levin, and W. Gary Mallard
Appearance energy determinations
Ion | AE (eV) | Other Products | Method | Reference | Comment |
---|---|---|---|---|---|
C7H11+ | 9.02 ± 0.05 | CH3 | EI | Blanchette, Holmes, et al., 1987 |

Phase change data

Data compiled by: Thermodynamics Research Center, NIST Boulder Laboratories, Chris Muzny director
Quantity | Value | Units | Method | Reference | Comment |
---|---|---|---|---|---|
Tboil | 397.7 | K | N/A | Muller and Roscheisen, 1957 | Uncertainty assigned by TRC = 1. K |
Tboil | 398. | K | N/A | Webb and Borcherdt, 1951 | Uncertainty assigned by TRC = 1. K |
Tboil | 397.65 | K | N/A | Henne, Chanan, et al., 1941 | Uncertainty assigned by TRC = 0.5 K |

References

Blanchette, Holmes, et al., 1987
Blanchette, M.C.; Holmes, J.L.; Lossing, F.P.,
Characterizing the 2-norbornyl cation in the gas phase,
J. Am. Chem. Soc., 1987, 109, 1392. [all data]