α,α-Dichloromethyl methyl ether

Gas phase ion energetics data

Data compiled as indicated in comments:
LBLHLM - Sharon G. Lias, John E. Bartmess, Joel F. Liebman, John L. Holmes, Rhoda D. Levin, and W. Gary Mallard
LLK - Sharon G. Lias, Rhoda D. Levin, and Sherif A. Kafafi

Ionization energy determinations

IE (eV) Method Reference Comment
10.84PEMolder, Pikver, et al., 1983LBLHLM
10.6PEVereschagin, Salikova, et al., 1980LLK
11.16PEVereschagin, Salikova, et al., 1980Vertical value; LLK

References

Molder, Pikver, et al., 1983
Molder, U.H.; Pikver, R.J.; Koppel, I.A., Photoelectron spectra of molecules. 2. Ethers, Org. React. (N.Y. Engl. Transl.), 1983, 20, 208. [all data]

Vereschagin, Salikova, et al., 1980
Vereschagin, A.N.; Salikova, A.M.; Zverev, V.V.; Saitkulova, F.G.; Villem, Y.Y., Physical properties, conformations, and intramolecular interactions of α, α-dichlorodimethyl ether, Bull. Acad. Sci. USSR, Div. Chem. Sci., 1980, 997. [all data]