1H-Indole, 4-methoxy-

Normal alkane RI, polar column, temperature ramp

View large format table.

Column type Active phase I Reference Comment
CapillaryTC-Wax2114.Miyazawa and Okuno, 2003He, 4. K/min, 250. C @ 30. min; Column length: 60. m; Column diameter: 0.25 mm; Tstart: 80. C

References

Miyazawa and Okuno, 2003
Miyazawa, M.; Okuno, Y., Volatile components from the roots of Scrophularia ningpoensis Hemsl., Flavour Fragr. J., 2003, 18, 5, 398-400, https://doi.org/10.1002/ffj.1232 . [all data]