Plumbagin

Normal alkane RI, non-polar column, temperature ramp

View large format table.

Column type Active phase I Reference Comment
CapillaryDB-51600.Najafpour Navaei, Mirza, et al., 200530. m/0.25 mm/0.25 μm, He, 50. C @ 5. min, 3. K/min; Tend: 250. C

References

Najafpour Navaei, Mirza, et al., 2005
Najafpour Navaei, M.; Mirza, M.; Dini, M., Chemical composition of the essential oil of Plumbago europaea L. roots from Iran, Flavour Fragr. J., 2005, 20, 2, 213-214, https://doi.org/10.1002/ffj.1384 . [all data]