2-Chlorocyclododecanone oxime

Gas phase ion energetics data

Data compiled as indicated in comments:
LLK - Sharon G. Lias, Rhoda D. Levin, and Sherif A. Kafafi

Ionization energy determinations

IE (eV) Method Reference Comment
9.18 ± 0.03PIGolubitskii, Kulikov, et al., 1979LLK

Appearance energy determinations

Ion AE (eV) Other Products MethodReferenceComment
C10H18ClNO+9.96 ± 0.05C2H4PIGolubitskii, Kulikov, et al., 1979LLK
C12H22NO+9.84 ± 0.05ClPIGolubitskii, Kulikov, et al., 1979LLK

References

Golubitskii, Kulikov, et al., 1979
Golubitskii, A.E.; Kulikov, N.S.; Zyakun, A.M.; Valovoi, V.A.; Alekseev, A.M.; Volkov, V.N., Photoionization mass spectra of alicyclic compounds with various substituents, and their ionization energies and appearance energies, Bull. Acad. Sci. USSR, Div. Chem. Sci., 1979, 11, 2602. [all data]