Ginkgolide B 3TMS

Kovats' RI, non-polar column, isothermal

View large format table.

Column type Active phase Temperature (C) I Reference Comment
CapillaryHP-1290.3211.Gögös, 2002Column length: 25. m; Column diameter: 0.2 mm
CapillaryHP-1300.3235.Gögös, 2002Column length: 25. m; Column diameter: 0.2 mm
CapillaryHP-1310.3259.Gögös, 2002Column length: 25. m; Column diameter: 0.2 mm

Van Den Dool and Kratz RI, non-polar column, custom temperature program

View large format table.

Column type Active phase I Reference Comment
CapillaryHP-5MS3190.3Andriamaharavo, 201430. m/0.25 mm/0.25 μm, He; Program: 60C (1 min) => 5 C/min => 210C => 10 C/min => 280C (15 min)

References

Gögös, 2002
Gögös, Éva, Identification and the retention index of bilobalide and ginkgolides using capillary gas chromatography, J. Chromatogr. Sci., 2002, 40, 9, 519-522, https://doi.org/10.1093/chromsci/40.9.519 . [all data]

Andriamaharavo, 2014
Andriamaharavo, N.R., Retention Data. NIST Mass Spectrometry Data Center., NIST Mass Spectrometry Data Center, 2014. [all data]