m-Fluorobenzamide

Gas phase ion energetics data

Data evaluated as indicated in comments:
HL - Edward P. Hunter and Sharon G. Lias

Data compiled as indicated in comments:
LL - Sharon G. Lias and Joel F. Liebman

Quantity Value Units Method Reference Comment
Proton affinity (review)877.2kJ/molN/AHunter and Lias, 1998HL
Quantity Value Units Method Reference Comment
Gas basicity846.3kJ/molN/AHunter and Lias, 1998HL

Ionization energy determinations

IE (eV) Method Reference Comment
9.6PEPetrachenko, Vovna, et al., 1992Vertical value; LL

References

Hunter and Lias, 1998
Hunter, E.P.; Lias, S.G., Evaluated Gas Phase Basicities and Proton Affinities of Molecules: An Update, J. Phys. Chem. Ref. Data, 1998, 27, 3, 413-656, https://doi.org/10.1063/1.556018 . [all data]

Petrachenko, Vovna, et al., 1992
Petrachenko, N.E.; Vovna, V.I.; Furin, G.G., He(I) photoelectron spectra of fluorine-substituted derivatives of benzoic acid, Zh. Org. Khim., 1992, 28, 1218. [all data]