Dichloro(ethyl)methylsilane
- Formula: C3H8Cl2Si
- Molecular weight: 143.087
- IUPAC Standard InChIKey: PNECSTWRDNQOLT-UHFFFAOYSA-N
- CAS Registry Number: 4525-44-4
- Chemical structure:
View 3d structure (requires JavaScript / HTML 5) - Other names: Ethylmethyldichlorosilane

Kovats' RI, non-polar column, isothermal

Column type | Active phase | Temperature (C) | I | Reference | Comment |
---|---|---|---|---|---|
Packed | Polymethylsiloxane, (PMS-20000) | 50. | 709.8 | Ainshtein and Shulyatieva, 1972 | He, Chromosorb W; Column length: 2. m |

References

Ainshtein and Shulyatieva, 1972
Ainshtein, A.A.; Shulyatieva, T.I.,
Retention indices of alkyl- and arylchlorosilanes,
Zh. Anal. Khim., 1972, 27, 816-821. [all data]