Cyclohexaneethanol

Normal alkane RI, non-polar column, custom temperature program

View large format table.

Column type Active phase I Reference Comment
CapillarySE-301098.Vinogradov, 2004Program: not specified
CapillaryOV-1011098.Krings, Banavara, et al., 2003Program: not specified

Normal alkane RI, polar column, custom temperature program

View large format table.

Column type Active phase I Reference Comment
CapillaryCarbowax 20M1668.Vinogradov, 2004Program: not specified
CapillaryCarbowax 20M1668.Krings, Banavara, et al., 2003Program: not specified

Phase change data

Data compiled by: Robert L. Brown and Stephen E. Stein

Reduced pressure boiling point

Tboil (K) Pressure (bar) Reference
479.70.993Aldrich Chemical Company Inc., 1990

References

Vinogradov, 2004
Vinogradov, B.A., Production, composition, properties and application of essential oils, 2004, retrieved from http://viness.narod.ru. [all data]

Krings, Banavara, et al., 2003
Krings, U.; Banavara, D.S.; Berger, R.G., Thin layer high vacuum distillation to isolate the flavor of high-fat food, Eur. Food Res. Technol., 2003, 217, 1, 70-73, https://doi.org/10.1007/s00217-003-0700-9 . [all data]