Methane, bis(tert-butylthio)-
- Formula: C9H20S2
- Molecular weight: 192.385
- IUPAC Standard InChIKey: HCODNZPTXNCDTN-UHFFFAOYSA-N
- CAS Registry Number: 4345-98-6
- Chemical structure:
View 3d structure (requires JavaScript / HTML 5) - Other names: 2,2,6,6-tetramethyl-3,5-dithiaheptane; Propane, 2,2'-[methylenebis(thio)]bis[2-methyl-; Formaldehyde di-tert-butylmercaptal

Kovats' RI, non-polar column, isothermal

Column type | Active phase | Temperature (C) | I | Reference | Comment |
---|---|---|---|---|---|
Packed | Apiezon M | 130. | 1233. | Garbuzov, Misharina, et al., 1985 | He or N2, Chromosorb W, AW-DMCS; Column length: 2.1 m |

References

Garbuzov, Misharina, et al., 1985
Garbuzov, V.G.; Misharina, T.A.; Aerov, A.F.; Golovnya, R.V.,
Gas chromatographic retention indices for sulphur(II)-containing organic substances,
J. Anal. Chem. USSR (Engl. Transl.), 1985, 40, 4, 576-586. [all data]