Triadimefon

Kovats' RI, non-polar column, isothermal

View large format table.

Column type Active phase Temperature (C) I Reference Comment
CapillaryOV-1190.1966.Erdmann, Rochholz, et al., 1992
CapillaryOV-1220.1981.Erdmann, Rochholz, et al., 1992

Van Den Dool and Kratz RI, non-polar column, temperature ramp

View large format table.

Column type Active phase I Reference Comment
CapillarySLB-5MS1990.Mondello, Casilli, et al., 200730. m/0.25 mm/0.25 μm, He, 2. K/min; Tstart: 70. C; Tend: 300. C
CapillarySLB-5MS1997.Mondello, Casilli, et al., 200730. m/0.25 mm/0.25 μm, He, 2. K/min; Tstart: 70. C; Tend: 300. C

Normal alkane RI, non-polar column, custom temperature program

View large format table.

Column type Active phase I Reference Comment
Capillary5 % Phenyl methyl siloxane1999.Department of Food Safety and Welfare, 200630. m/0.25 mm/0.25 μm, Helium; Program: 50 0C(1 min) 25 0C/min -> 125 0C 10 0C/min -> 300 0C (10 min)
Capillary5 % Phenyl methyl siloxane1999.Department of Food Safety and Welfare, 200630. m/0.25 mm/0.25 μm, Helium; Program: 50 0C(1 min) 25 0C/min -> 125 0C 10 0C/min -> 300 0C (10 min)
CapillaryMethyl Silicone1968.Zenkevich, Ostroukhova, et al., 2002Program: not specified
CapillaryUltra-11939.Tameo and Kiyos, 1991Program: not specified

Normal alkane RI, polar column, custom temperature program

View large format table.

Column type Active phase I Reference Comment
CapillaryCarbowax 20M2942.Tameo and Kiyos, 1991Program: not specified

Phase change data

Data compiled as indicated in comments:
TRC - Thermodynamics Research Center, NIST Boulder Laboratories, Chris Muzny director
AC - William E. Acree, Jr., James S. Chickos

Quantity Value Units Method Reference Comment
Tfus353.62KN/ADonnelly, Drewes, et al., 1990Uncertainty assigned by TRC = 0.2 K; TRC
Tfus350.2KN/AVorontsova and Vlasov, 1987Crystal phase 1 phase; Uncertainty assigned by TRC = 0.5 K; TRC

Enthalpy of sublimation

ΔsubH (kJ/mol) Temperature (K) Method Reference Comment
111.1 ± 2.2303.GSDa Silva and Da Silva, 1997Based on data from 298. - 343. K.; AC

Enthalpy of fusion

ΔfusH (kJ/mol) Temperature (K) Method Reference Comment
22.87351.4DSCDonnelly, Drewes, et al., 1990, 2AC

In addition to the Thermodynamics Research Center (TRC) data available from this site, much more physical and chemical property data is available from the following TRC products:

References

Erdmann, Rochholz, et al., 1992
Erdmann, F.; Rochholz, G.; Schütz, H., Retention-indices on OV-1 of approximately 170 commonly used pesticides, Mikrochim. Acta, 1992, 106, 3-6, 219-226, https://doi.org/10.1007/BF01242093 . [all data]

Mondello, Casilli, et al., 2007
Mondello, L.; Casilli, A.; Tranchida, P.Q.; Presti, M.L.; Dugo, P.; Dugo, G., Comprehensive gas chromatography coupled to mass spectrometry for the separation of pesticides in a very complex matrix, Anal. Bioanal. Chem., 2007, 389, 6, 1755-1763, https://doi.org/10.1007/s00216-007-1412-y . [all data]

Department of Food Safety and Welfare, 2006
Department of Food Safety, Ministry of Health; Welfare, Analytical methods for residual compositional substances of agricultural chemicals, feed aadditives, and veterinary drugs in foods, 2006, retrieved from http://www.mhlw.go.jp/english/topics/foodsafety/positivelist060228/de/060526-1a.pdf. [all data]

Zenkevich, Ostroukhova, et al., 2002
Zenkevich, I.G.; Ostroukhova, O.K.; Dolzhenko, V.I., Optimum analytical parameters for chromatographic characterization of pesticides, J. Anal. Chem. USSR (Engl. Transl.), 2002, 57, 1, 35-39. [all data]

Tameo and Kiyos, 1991
Tameo, O.; Kiyos, I., Simultaneous determination of pesticides by capillary gas chromatography, Cannot be traslated (in Japan), 1991, 14, 2, 109-122. [all data]