2,4(1H,3H)-Pyrimidinedione,3,5-dimethyl-

Gas phase ion energetics data

Data compiled by: Sharon G. Lias, Rhoda D. Levin, and Sherif A. Kafafi

Ionization energy determinations

IE (eV) Method Reference
8.6 ± 0.1EIVerkin, Sukodub, et al., 1976

References

Verkin, Sukodub, et al., 1976
Verkin, B.I.; Sukodub, L.F.; Yanson, I.K., Ionization potentials of nitrogenous bases of of nucleic acids, Dokl. Akad. Nauk SSSR, 1976, 228, 1452. [all data]