2-Propenoic acid, 2-methyl-3,3-bis[(trimethylsilyl)oxy]-, trimethylsilyl ester

Normal alkane RI, non-polar column, temperature ramp

View large format table.

Column type Active phase I Reference Comment
PackedOV-11424.Mamer and Tjoa, 1973Helium, Chromosorb W HP, 5. K/min; Column length: 2. m; Tstart: 90. C; Tend: 270. C

References

Mamer and Tjoa, 1973
Mamer, O.A.; Tjoa, S.S., Trimethylsilylation of Malonate Esters Enols, Clinical Chemistry, 1973, 19, 1, 58-61. [all data]