Fenobucarb

Kovats' RI, non-polar column, custom temperature program

View large format table.

Column type Active phase I Reference Comment
CapillaryHP-51608.Tanabe, Mitobe, et al., 200030. m/0.32 mm/0.25 μm; Program: 50C(1min) => 20C/min => 150C => 10C/min => 280C(4min)

Van Den Dool and Kratz RI, non-polar column, temperature ramp

View large format table.

Column type Active phase I Reference Comment
CapillaryCBP-11570.Oyama, Sano, et al., 1987N2, 6. K/min; Column length: 12. m; Column diameter: 0.53 mm; Tstart: 120. C; Tend: 250. C

Van Den Dool and Kratz RI, non-polar column, custom temperature program

View large format table.

Column type Active phase I Reference Comment
CapillaryOV-1011567.Yasuhara, Shiraishi, et al., 199715. m/0.25 mm/0.25 μm, He; Program: 50C(2min) => (20C/min) => 120C => (7C/min) => 310C(10min)
Capillary5 % Phenyl methyl siloxane1612.Yasuhara, Shiraishi, et al., 199725. m/0.31 mm/0.52 μm, He; Program: 50C(2min) => (20C/min) => 120C => (7C/min) => 310C(10min)

Normal alkane RI, non-polar column, temperature ramp

View large format table.

Column type Active phase I Reference Comment
CapillaryHP-51621.Murayama, Mukai, et al., 200030. m/0.32 mm/0.25 μm, 50. C @ 1. min, 10. K/min, 300. C @ 4. min
CapillaryPolydimethyl siloxane1617.Hayakawa, Niinomi, et al., 199025. m/0.32 mm/0.52 μm, He, 6. K/min; Tstart: 60. C; Tend: 270. C

Normal alkane RI, non-polar column, custom temperature program

View large format table.

Column type Active phase I Reference Comment
Capillary5 % Phenyl methyl siloxane1609.Department of Food Safety and Welfare, 200630. m/0.25 mm/0.25 μm, Helium; Program: 50 0C(1 min) 25 0C/min -> 125 0C 10 0C/min -> 300 0C (10 min)
CapillaryHP-51608.Kawara, Asada, et al., 200530. m/0.25 mm/0.25 μm; Program: 50 0C (1 min) 20 0C/min -> 150 0C 10 0C/min -> 280 0C
CapillaryDB-51618.Kawata, Mukai, et al., 199630. m/0.25 mm/0.25 μm; Program: 50 0C (1 min) 20 0C/min -> 200 0C 10 0C/min -> 280 0C (2 min)
CapillaryUltra-11562.Tameo and Kiyos, 1991Program: not specified

Normal alkane RI, polar column, custom temperature program

View large format table.

Column type Active phase I Reference Comment
CapillaryCarbowax 20M2148.Tameo and Kiyos, 1991Program: not specified

References

Tanabe, Mitobe, et al., 2000
Tanabe, A.; Mitobe, H.; Kawata, K.; Sakai, M.; Yasuhara, A., New monitoring system for ninety pesticides and related compounds in river water by solid-phase extraction with determination by gas chromatography/mass spectrometry, J. AOAC Int., 2000, 83, 1, 61-77. [all data]

Oyama, Sano, et al., 1987
Oyama, N.; Sano, T.; Syoyama, M.; Maeda, K., Studies on systematic analysis of poisonous compounds in forensic chemistry. II. Application of capillary column gas chromatography to substance identification by means of retention indices, Eisei Kagaku, 1987, 33, 5, 342-348, https://doi.org/10.1248/jhs1956.33.342 . [all data]

Yasuhara, Shiraishi, et al., 1997
Yasuhara, A.; Shiraishi, H.; Nishikawa, M.; Yamamoto, T.; Uehiro, T.; Nakasugi, O.; Okumura, T.; Kenmotsu, K.; Fukui, H.; Nagase, M.; Ono, Y.; Kawagoshi, Y.; Baba, K.; Noma, Y., Determination of organic components in leachates from hazardous waste disposal sites in Japan by gas chromatography-mass spectrometry, J. Chromatogr. A, 1997, 774, 1-2, 321-332, https://doi.org/10.1016/S0021-9673(97)00078-2 . [all data]

Murayama, Mukai, et al., 2000
Murayama, H.; Mukai, H.; Mitobe, H.; Moriyama, N., Simple method for determining trace pesticides in air using extraction disks, Anal. Sci., 2000, 16, 3, 257-263, retrieved from http://wwwsoc.nii.ac.;p/jsac/analsci/pdfs/a160257.pdf, https://doi.org/10.2116/analsci.16.257 . [all data]

Hayakawa, Niinomi, et al., 1990
Hayakawa, S.; Niinomi, J.; Kato, S.; Kanamaru, T., Retention time and mass number of agrochemicals by capillary column GC/MS, Mie-ken Kankyo-Kagaku Senta-kenkyu-ho-koku (Report of the Environmental Science Institute of Mie Prefecture), 1990, 10, 53-56. [all data]

Department of Food Safety and Welfare, 2006
Department of Food Safety, Ministry of Health; Welfare, Analytical methods for residual compositional substances of agricultural chemicals, feed aadditives, and veterinary drugs in foods, 2006, retrieved from http://www.mhlw.go.jp/english/topics/foodsafety/positivelist060228/de/060526-1a.pdf. [all data]

Kawara, Asada, et al., 2005
Kawara, K.; Asada, T.; Oikawa, K.; Tanabe, A., Multiresidue determination of pesticides in sediments by ultrasonically assisted extraction and gas chromatography/mass spectrometry, J. AOAC International, 2005, 88, 5, 1440-1451. [all data]

Kawata, Mukai, et al., 1996
Kawata, K.; Mukai, H.; Tanabe, H.; Yasuhara, A., Annual variation of insecticides in precipitation in rural Japan, Bull. Environ. Contam. Toxicol., 1996, 57, 6, 853-858, https://doi.org/10.1007/s001289900268 . [all data]

Tameo and Kiyos, 1991
Tameo, O.; Kiyos, I., Simultaneous determination of pesticides by capillary gas chromatography, Cannot be traslated (in Japan), 1991, 14, 2, 109-122. [all data]