3-Nonen-1-ol, acetate
- Formula: C11H20O2
- Molecular weight: 184.2753
- IUPAC Standard InChIKey: USUBZNPOHYPUIV-CSKARUKUSA-N
- CAS Registry Number: 36809-53-7
- Chemical structure:
View 3d structure (requires JavaScript / HTML 5) - Other names: non-3-enyl acetate

Van Den Dool and Kratz RI, non-polar column, temperature ramp

Column type | Active phase | I | Reference | Comment |
---|---|---|---|---|
Capillary | HP-5 | 1140. | Shalit, Katzir, et al., 2001 | He, 50. C @ 1. min, 4. K/min; Column length: 30. m; Column diameter: 0.25 mm; Tend: 200. C |

References

Shalit, Katzir, et al., 2001
Shalit, M.; Katzir, N.; Tadmor, Y.; Larkov, O.; Burger, Y.; Shalekhet, F.; Lastochkin, E.; Ravid, U.; Amar, O.; Edelstein, M.; Karchi, Z.; Lewinsohn, E.,
Acetyl-CoA: alcohol acetyltransferase activity and aroma formation in ripening melon fruits,
J. Agric. Food Chem., 2001, 49, 2, 794-799, https://doi.org/10.1021/jf001075p
. [all data]