Piperidine, 3,5-dimethyl-
- Formula: C7H15N
- Molecular weight: 113.2007
- IUPAC Standard InChIKey: IDWRJRPUIXRFRX-UHFFFAOYSA-N
- CAS Registry Number: 35794-11-7
- Chemical structure:
View 3d structure (requires JavaScript / HTML 5) - Other names: 3,5-Dimethylpiperidine

Normal alkane RI, non-polar column, custom temperature program

Column type | Active phase | I | Reference | Comment |
---|---|---|---|---|
Capillary | Methyl Silicone | 889. | Farkas, Héberger, et al., 2004 | Program: not specified |

Phase change data

Data compiled as indicated in comments:
BS - Robert L. Brown and Stephen E. Stein
AC - William E. Acree, Jr., James S. Chickos
Quantity | Value | Units | Method | Reference | Comment |
---|---|---|---|---|---|
Tboil | 417.2 | K | N/A | Weast and Grasselli, 1989 | BS |
Quantity | Value | Units | Method | Reference | Comment |
ΔvapH° | 11.7 ± 0.1 | kcal/mol | C | Ribeiro da Silva, Cabral, et al., 2006 | AC |

References

Farkas, Héberger, et al., 2004
Farkas, O.; Héberger, K.; Zenkevich, I.G.,
Quantitative structure-retention relationships. XIV. Prediction of gas chromatographic retention indices for saturated O-, N-, and S-heterocyclic compounds,
Chemom. Intell. Lab. Syst., 2004, 72, 2, 173-184, https://doi.org/10.1016/j.chemolab.2004.01.012
. [all data]