1-Nonanol, 4,8-dimethyl-
- Formula: C11H24O
- Molecular weight: 172.3077
- IUPAC Standard InChIKey: ASDSWUHLJCTXPE-UHFFFAOYSA-N
- CAS Registry Number: 33933-80-1
- Chemical structure:
View 3d structure (requires JavaScript / HTML 5) - Species with the same structure:
- Other names: 4,8-Dimethyl-1-nonanol; 4,8-Dimethylnonanol

Normal alkane RI, non-polar column, custom temperature program

Column type | Active phase | I | Reference | Comment |
---|---|---|---|---|
Capillary | SLB-5 MS | 1229. | Mondello, 2012 | 30. m/0.25 mm/0.25 μm, Helium; Program: not specified |
Capillary | SLB-5 MS | 1230. | Mondello, 2012 | 30. m/0.25 mm/0.25 μm, Helium; Program: not specified |

References

Mondello, 2012
Mondello, L.,
HS-SPME-GCxGC-MS analysis of Yerba Mate (Ilex paraguariensis)
in Shimadzu GC-GC application compendium of comprehensive 2D GC, Vol. 1-5, Shimadzu Corp., 2012, 1-29. [all data]