3,3,4,4,7,7,8,8,11,11,12,12-Dodecafluorotetracyclo-[8.2.0.02,5.06,9]dodeca-1,5,9-triene

Gas phase ion energetics data

Data compiled as indicated in comments:
LBLHLM - Sharon G. Lias, John E. Bartmess, Joel F. Liebman, John L. Holmes, Rhoda D. Levin, and W. Gary Mallard

Ionization energy determinations

IE (eV) Method Reference Comment
11.1PEHeilbronner, Wirz, et al., 1984LBLHLM
11.5PEHeilbronner, Wirz, et al., 1984Vertical value; LBLHLM

References

Heilbronner, Wirz, et al., 1984
Heilbronner, E.; Wirz, J.; Soulen, R.L., 6. The He(Iα) photoelectron spectra of the perfluoroderivatives of trisannelated benzenes and tetrakisannelated cyclooctatetraenes, Helv. Chim. Acta, 1984, 67, 47. [all data]