1,3,2-Diazaphosphetidin-4-one,2-(diethylamino)-2,2-difluoro-2,2-dihydro-1,3-dimethyl-

Gas phase ion energetics data

Data compiled by: Sharon G. Lias, Rhoda D. Levin, and Sherif A. Kafafi

Ionization energy determinations

IE (eV) Method Reference
8.9 ± 0.1EIBaldwin, Loudon, et al., 1977

References

Baldwin, Loudon, et al., 1977
Baldwin, M.A.; Loudon, A.G.; Dunmur, R.E.; Schmutzler, R.; Gregor, I.K., Charge location and fragmentation under electron impact. IV-The behaviour under electron impact of some N-methyl, N'-R-1,2,4-phosphadiazetidine-3-ones and related compounds, Org. Mass Spectrom., 1977, 12, 275. [all data]