7-Methylenebicyclo[2.2.1]-heptane

Gas phase ion energetics data

Data compiled as indicated in comments:
LLK - Sharon G. Lias, Rhoda D. Levin, and Sherif A. Kafafi

Ionization energy determinations

IE (eV) Method Reference Comment
9.40PEHoffmann, Schuttler, et al., 1972Vertical value; LLK

Phase change data

Data compiled as indicated in comments:
ALS - Hussein Y. Afeefy, Joel F. Liebman, and Stephen E. Stein
DRB - Donald R. Burgess, Jr.

Quantity Value Units Method Reference Comment
Δsub9.7 ± 0.5kcal/molVKozina, Bychikhina, et al., 1977ALS
Δsub9.56kcal/molN/AKozina, Bychikhina, et al., 1977DRB

References

Hoffmann, Schuttler, et al., 1972
Hoffmann, R.W.; Schuttler, R.; Schafer, W.; Schweig, A., Methylen-norbornadien, ein bicycloheptafulven, Angew. Chem., 1972, 84, 533. [all data]